{"text_format":"3","workbook":"xlsx","n_sheets":3,"sheets":["参加承諾書（学校用）（入力上の留意点）","参加承諾書（学校用） ","コード一覧（このページは変更しないでください）"],"not_rendered":{"images":4,"macros":1,"defined_names":3,"comments":1},"read":"whole","date_system":"1900"}

{"sheet":"参加承諾書（学校用）（入力上の留意点）","index":0,"n_rows":67,"n_cols":11,"rows_kept":67,"merged":[[0,0,0,6],[2,8,2,9],[3,1,3,4],[3,8,3,9],[4,1,4,6],[5,1,5,3],[5,5,5,6],[9,0,10,0],[9,1,10,2],[9,3,10,3],[9,5,10,5],[9,6,10,6],[11,0,13,0],[11,1,11,2],[12,1,12,2],[13,1,13,2],[14,0,15,0],[14,1,14,2],[15,1,15,2],[16,1,16,2],[17,1,17,2],[18,0,20,0],[18,1,18,2],[19,1,19,2],[20,1,20,2],[21,1,21,2],[22,0,24,0],[22,1,22,2],[23,1,23,2],[24,1,24,2],[25,0,26,0],[25,1,25,2],[26,1,26,2],[27,1,27,2],[28,1,28,2],[29,0,38,0],[29,1,34,1],[35,1,38,1],[39,1,39,2],[40,1,40,2],[41,0,44,0],[41,1,41,2],[42,1,42,2],[43,1,43,2],[44,1,44,2],[45,0,47,0],[45,1,45,2],[46,1,46,2],[47,1,47,2],[48,0,51,0],[48,1,48,2],[49,1,49,2],[50,1,50,2],[51,1,51,2],[52,1,52,2],[53,1,53,2],[54,1,54,2],[55,0,56,0],[55,1,55,2],[56,1,56,2],[57,0,61,0],[57,1,57,2],[58,1,58,2],[58,8,58,14],[59,1,59,2],[59,8,59,14],[60,1,60,2],[61,1,61,2],[62,0,66,0],[62,1,65,1],[63,8,63,14],[64,8,64,14],[66,1,66,2],[66,8,66,14],[67,8,67,14],[68,8,68,14]]}
["第５０回全国高等学校総合文化祭参加承諾書（学校用）　【入力上の注意点】"]
[]
["学校名　（正式名称を記入してください。）",{"$nulls":6},"都道府県選択⇒","秋田県",null,{"$f":"VLOOKUP(I3,'コード一覧（このページは変更しないでください）'!A2:B48,2,FALSE)","v":"05"}]
["学校名",{"$nulls":4},"校長名",null,"部門選択⇒","吹奏楽",null,{"$f":"VLOOKUP(I4,'コード一覧（このページは変更しないでください）'!C2:D20,2,FALSE)","v":"03"}]
["所在地","〒"]
["TEL",{"$nulls":3},"E-mail"]
[]
["部門・種目","　（該当項目の参加欄に○印を付け、出演予定生徒人数又は出品点数と出演生徒以外の参加予定生徒"]
[null,"　 人数を記入してください。）"]
["部　　門","種　目",null,"参　加","出演予定生徒人数","出演生徒以外の\n参加予定生徒人数","備　考　(演目、作品企画、特色、その他）"]
[{"$nulls":4},"または出品点数",{"$nulls":3},"現在開いているファイルと同じフォルダに次のファイル名で名前を付けて保存できます。"]
["パレード","マーチングバンド",{"$nulls":6},{"$f":"K3&\"_\"&K4&\"_参加承諾書_\"&B4","v":"05_03_参加承諾書_"}]
[null,"バトントワリング"]
[null,"他（　　　　　　　　　　　）"]
["演　劇","上演"]
[null,"生徒講評委員"]
["合　唱"]
["吹奏楽"]
["器楽・管弦楽","器楽（　　　　　　　　　）"]
[null,"管弦楽"]
[null,"他（　　　　　　　　　　　）"]
["日本音楽"]
["吟詠剣詩舞","吟詠"]
[null,"剣詩舞"]
[null,"構成吟"]
["郷土芸能","伝承芸能"]
[null,"和太鼓"]
["マーチングバンド･","マーチングバンド"]
["バトントワリング","バトントワリング"]
["美術・工芸","平面\n（壁面展示）","絵画"]
[null,null,"版画"]
[null,null,"デザイン"]
[null,null,"工芸"]
[null,null,"彫刻"]
[null,null,"映像(スクリーン展示)"]
[null,"立体\n（空間展示）","彫刻"]
[null,null,"デザイン"]
[null,null,"工芸"]
[null,null,"映像(空間展示）"]
["書　道"]
["写　真"]
["放　送","アナウンス"]
[null,"朗　読"]
[null,"オーディオメッセージ（ＡＭ）"]
[null,"ビデオメッセージ（ＶＭ）"]
["囲　碁","男子個人戦"]
[null,"女子個人戦"]
[null,"団体戦（男女混成）"]
["将　棋","男子団体戦"]
[null,"女子団体戦"]
[null,"男子個人戦"]
[null,"女子個人戦"]
["弁　論"]
["小倉百人一首","競技"]
["かるた","読手コンクール"]
["新　聞","都道府県派遣枠"]
[null,"「年間紙面審査」入賞校"]
["文芸","部誌"]
[null,"散文"]
[null,"詩"]
[null,"短歌"]
[null,"俳句"]
["自然科学","研究発表","物理"]
[null,null,"化学"]
[null,null,"生物"]
[null,null,"地学"]
[null,"ポスター発表"]

{"sheet":"参加承諾書（学校用） ","index":1,"n_rows":80,"n_cols":26,"rows_kept":80,"merged":[[0,0,0,6],[2,8,2,9],[3,1,3,4],[3,8,3,9],[4,1,4,6],[5,1,5,3],[5,5,5,6],[9,0,10,0],[9,1,10,2],[9,3,10,3],[9,5,10,5],[9,6,10,6],[11,0,13,0],[11,1,11,2],[12,1,12,2],[13,1,13,2],[14,0,15,0],[14,1,14,2],[15,1,15,2],[16,1,16,2],[17,1,17,2],[18,0,20,0],[18,1,18,2],[19,1,19,2],[20,1,20,2],[21,1,21,2],[22,0,24,0],[22,1,22,2],[23,1,23,2],[24,1,24,2],[25,0,26,0],[25,1,25,2],[26,1,26,2],[27,1,27,2],[28,1,28,2],[29,0,38,0],[29,1,34,1],[35,1,38,1],[39,1,39,2],[40,1,40,2],[41,0,44,0],[41,1,41,2],[42,1,42,2],[43,1,43,2],[44,1,44,2],[45,0,47,0],[45,1,45,2],[46,1,46,2],[47,1,47,2],[48,0,51,0],[48,1,48,2],[49,1,49,2],[50,1,50,2],[51,1,51,2],[52,1,52,2],[53,1,53,2],[54,1,54,2],[55,0,56,0],[55,1,55,2],[56,1,56,2],[57,0,61,0],[57,1,57,2],[58,1,58,2],[59,1,59,2],[60,1,60,2],[61,1,61,2],[62,0,66,0],[62,1,65,1],[66,1,66,2],[69,0,69,6],[69,8,69,14],[70,0,70,6],[70,8,70,14],[71,0,71,6],[72,0,72,6],[73,0,73,6],[74,0,74,6],[74,8,74,14],[75,0,75,6],[75,8,75,14],[76,0,76,6],[77,0,77,6],[77,8,77,14],[78,0,78,6],[78,8,78,14],[79,0,79,6],[79,8,79,14]]}
["第５０回全国高等学校総合文化祭参加承諾書（学校用）",{"$nulls":24},"○"]
[]
["学校名　（正式名称を記入してください。）",{"$nulls":6},"都道府県選択⇒",null,null,{"$f":"VLOOKUP(I3,'コード一覧（このページは変更しないでください）'!A2:B48,2,FALSE)","v":{"$error":"#N/A"}}]
["学校名",{"$nulls":4},"校長名",null,"部門選択⇒",null,null,{"$f":"VLOOKUP(I4,'コード一覧（このページは変更しないでください）'!C2:D21,2,FALSE)","v":{"$error":"#N/A"}}]
["所在地","〒"]
["TEL",{"$nulls":3},"E-mail"]
[]
["部門・種目","　（該当項目の参加欄に○印を付け、出演予定生徒人数又は出品点数と出演生徒以外の参加予定生徒"]
[null,"　 人数を記入してください。）"]
["部　　門","種　目",null,"参　加","出演予定生徒人数","出演生徒以外の\n参加予定生徒人数","備　考　(演目、作品企画、特色、その他）"]
[{"$nulls":4},"または出品点数",{"$nulls":3},"現在開いているファイルと同じフォルダに次のファイル名で名前を付けて保存できます。"]
["パレード","マーチングバンド",{"$nulls":6},{"$f":"K3&\"_\"&K4&\"_参加承諾書_\"&B4","v":{"$error":"#N/A"}}]
[null,"バトントワリング"]
[null,"他（　　　　　　　　　　　）"]
["演　劇","上演"]
[null,"生徒講評委員"]
["合　唱"]
["吹奏楽"]
["器楽・管弦楽","器楽（　　　　　　　　　）"]
[null,"管弦楽"]
[null,"他（　　　　　　　　　　　）"]
["日本音楽"]
["吟詠剣詩舞","吟詠"]
[null,"剣詩舞"]
[null,"構成吟"]
["郷土芸能","伝承芸能"]
[null,"和太鼓"]
["マーチングバンド･","マーチングバンド"]
["バトントワリング","バトントワリング"]
["美術・工芸","平面\n（壁面展示）","絵画"]
[null,null,"版画"]
[null,null,"デザイン"]
[null,null,"工芸"]
[null,null,"彫刻"]
[null,null,"映像(スクリーン展示)"]
[null,"立体\n（空間展示）","彫刻"]
[null,null,"デザイン"]
[null,null,"工芸"]
[null,null,"映像(空間展示）"]
["書　道"]
["写　真"]
["放　送","アナウンス"]
[null,"朗　読"]
[null,"オーディオメッセージ（ＡＭ）"]
[null,"ビデオメッセージ（ＶＭ）"]
["囲　碁","男子個人戦"]
[null,"女子個人戦"]
[null,"団体戦（男女混成）"]
["将　棋","男子団体戦"]
[null,"女子団体戦"]
[null,"男子個人戦"]
[null,"女子個人戦"]
["弁　論"]
["小倉百人一首","競技"]
["かるた","読手コンクール"]
["新　聞","都道府県派遣枠"]
[null,"「年間紙面審査」入賞校"]
["文芸","部誌"]
[null,"散文"]
[null,"詩"]
[null,"短歌"]
[null,"俳句"]
["自然科学","研究発表","物理"]
[null,null,"化学"]
[null,null,"生物"]
[null,null,"地学"]
[null,"ポスター発表"]
[]
["【入力上の留意点】"]
["（１）記入については、各部門参加要項を参照してください。\n　　また、他校との合同出演の場合には、「備考」欄に合同団体名を記入してください。"]
["（２）「校長名」は、校長御自身に入力していただいてください。"]
["（３）演劇部門の「出演予定生徒人数」欄には「キャスト」＋「スタッフ」の合計人数を記入してください。\n　　また、「出演生徒以外の参加予定生徒人数」欄には「出演予定生徒人数」欄に入らないその他の参加者がある\n　　場合、その人数を記入してください。"]
["（４）合唱、吹奏楽、器楽･管弦楽、日本音楽、吟詠剣詩舞、郷土芸能、ﾏｰﾁﾝｸﾞﾊﾞﾝﾄﾞ・ﾊﾞﾄﾝﾄﾜﾘﾝｸﾞ部門について、\n　　ステージ等で演技・演奏する出演生徒人数合計を「出演予定生徒人数」欄に記入してください。また、「出演\n　　生徒以外の参加予定生徒人数」欄には、「出演予定生徒人数」欄に入らないその他の生徒（補助員等）がいる\n　　場合、その人数を記入してください。"]
["（５）美術・工芸部門について、共同作品の場合は、出品点数を記入の上、その制作者の合計人数を「出演生徒以\n　　外の参加予定生徒人数」欄に記入してください。"]
["（６）写真部門について、出品生徒以外で、撮影会等に参加申込予定の生徒の人数を「出演生徒以外の参加予定生\n　　徒人数」欄に記入してください。"]
["（７）放送部門について、アナウンス、朗読については「出演予定生徒人数」欄に発表生徒の人数を記入してくだ\n　　さい。ＡＭ、ＶＭについては「出品点数」の欄に出品数を記入してください。「出演生徒以外の参加予定生徒\n　　人数」欄に参加する制作者人数を記入してください。"]
["（８）新聞部門の「「年間紙面審査」入賞校」欄は、「全国高等学校文化連盟新聞専門部第30回年間紙面審査賞」\n　　入賞校（別枠取扱い）として推薦する場合のみ記入してください。"]
["（９）文芸部門について、部門参加生徒の人数は、「出演予定生徒人数」欄に、視察等生徒の人数は、「出演生徒\n　　以外の参加予定生徒人数」欄に記入してください。なお、部門参加生徒については、文学研修（文学散歩）の\n　　みの参加はできませんので、御留意ください。"]
["（10）自然科学部門について、発表生徒の人数を「出演予定生徒人数」欄に記入してください。※今大会は観覧者\n　　は参加出来ません。"]
["（11）この用紙は各学校で各部門ごとにそれぞれ分けて作成してください。（３部門に参加する場合は３枚作成し\n　　てください。）"]

{"sheet":"コード一覧（このページは変更しないでください）","index":2,"n_rows":48,"n_cols":4,"rows_kept":48}
["都道府県","都道府県コード","部門","部門コード"]
["北海道","01","パレード","00"]
["青森県","02","演劇","01"]
["岩手県","03","合唱","02"]
["宮城県","04","吹奏楽","03"]
["秋田県","05","器楽・管弦楽","04"]
["山形県","06","日本音楽","05"]
["福島県","07","吟詠剣詩舞","06"]
["茨城県","08","郷土芸能","07"]
["栃木県","09","Ｍ＆Ｂ","08"]
["群馬県","10","美術・工芸","09"]
["埼玉県","11","書道","10"]
["千葉県","12","写真","11"]
["東京都","13","放送","12"]
["神奈川県","14","囲碁","13"]
["新潟県","15","将棋","14"]
["富山県","16","弁論","15"]
["石川県","17","小倉百人一首かるた","16"]
["福井県","18","新聞","17"]
["山梨県","19","文芸","18"]
["長野県","20","自然科学","19"]
["岐阜県","21"]
["静岡県","22"]
["愛知県","23"]
["三重県","24"]
["滋賀県","25"]
["京都府","26"]
["大阪府","27"]
["兵庫県","28"]
["奈良県","29"]
["和歌山県","30"]
["鳥取県","31"]
["島根県","32"]
["岡山県","33"]
["広島県","34"]
["山口県","35"]
["徳島県","36"]
["香川県","37"]
["愛媛県","38"]
["高知県","39"]
["福岡県","40"]
["佐賀県","41"]
["長崎県","42"]
["熊本県","43"]
["大分県","44"]
["宮崎県","45"]
["鹿児島県","46"]
["沖縄県","47"]